{"text_format":"1","workbook":"xlsx","n_sheets":11,"sheets":["Readme First","Emergency Parameters","A.Ops","B.Staff","C.ABOD","D.Appeal (DER)","E. Positions (optional)","Summary","Emergency Standards","Unit Costs","2.Ops Staging for Appeal"],"not_rendered":{"charts":0,"images":1,"macros":1,"external_links":0,"defined_names":12,"comments":5,"pivot_tables":0},"unopened":[],"bounds":{"document_bytes":16777216,"sheet_cells":100000,"rows_first":2000,"rows_last":500,"rows_between":2000,"halvings":0,"cell_chars":16384,"cell_head_chars":4096},"cells_cut":0,"cells_raw":0,"read":"whole","date_system":"1900"}

{"sheet":"Readme First","index":0,"n_rows":0,"n_cols":0,"rows_kept":0,"cut":false,"hidden":false,"merged":[]}

{"sheet":"Emergency Parameters","index":1,"n_rows":263,"n_cols":6,"rows_kept":263,"cut":false,"hidden":false,"merged":[]}
["Emergency Response Budgeting Template"]
["Resource Requirements"]
[]
[]
[]
[]
[]
[]
[]
[null,null,null,"Emergency in:"]
[]
[]
[null,null,null,null,null,"Template version: Aug 2014"]
["I. Population Projection and Operational Setup"]
[1,"Projected number of population",null,null,null,20000]
[]
[2,"Projected duration of emergency (in months)",null,null,null,6]
[]
[3,"If the emergency is due to a new pillar, select one as appropriate."]
[]
{"$rows_left_out":244}
{"sheet":"A.Ops","index":2,"n_rows":89,"n_cols":9,"rows_kept":89,"cut":false,"hidden":false,"merged":[[0,0,0,8]]}
["Annex II.A: Operations Budget (Based on Emergency Parameters* section I and II)"]
["Emergency in:",null,{"$f":"'Emergency Parameters'!E10","v":0}]
[]
["Rights Group","Objectives","Outputs / Budget Lines",null,"Qty (Target)","Unit","Unit Cost","Time","Amount (USD)"]
["Basic Needs and Essential Services",null,null,null,null,null,null,null,{"$f":"SUM(I6,I10,I13,I20,I24,I29,I33,I36,I39,I42)","v":10516488.800000001}]
[null,"Shelter and infrastructure established, improved and maintained",null,null,null,null,null,null,{"$f":"SUM(I7:I9)","v":3588525}]
[null,null,"Emergency shelter provided","(tent/materials/kit)",{"$f":"('Emergency Parameters'!F15/'Emergency Standards'!E3)*'Emergency Parameters'!F50","v":5000},"shelter",{"$f":"'Unit Costs'!F10","v":697.70500000000004},1,{"$f":"E7*G7*H7","v":3488525}]
[null,null,"Emergency shelter provided","(site preparation)",{"$f":"'Emergency Parameters'!F15/'Emergency Standards'!E7","v":2},"camp",50000,1,{"$f":"E8*G8*H8","v":100000}]
[null,null,"Unspecified output - Shelter and Infrastructure","(other - define)",1,"lumpsum",null,1,{"$f":"E9*G9*H9","v":0}]
[null,"Population has sufficient basic and domestic items",null,null,null,null,null,null,{"$f":"SUM(I11:I12)","v":605272}]
[null,null,"Household goods provided",null,{"$f":"('Emergency Parameters'!F15/'Emergency Standards'!E3)*'Emergency Parameters'!F52","v":5000},"family",{"$f":"'Unit Costs'!F25","v":121.0544},1,{"$f":"E11*G11*H11","v":605272}]
[null,null,"Unspecified output - Basic and Domestic Items",null,1,"lumpsum",null,1,{"$f":"E12*G12*H12","v":0}]
[null,"Health status of the population improved",null,null,null,null,null,null,{"$f":"SUM(I14:I19)","v":686095}]
[null,null,"Access to primary health care services provided or supported",null,{"$f":"'Emergency Parameters'!F15*'Emergency Parameters'!F54","v":20000},"person",5,{"$f":"'Emergency Parameters'!F17","v":6},{"$f":"E14*G14*H14","v":600000}]
[null,null,"Access to primary health care services provided or supported","(hospital tent)",{"$f":"IF('Emergency Parameters'!$F$54>0, 'Emergency Parameters'!$F$15/'Emergency Standards'!$E$32, \"0\")","v":1},"centre",2145,1,2145]
[null,null,"Access to primary health care services provided or supported","(ambulance)",{"$f":"IF('Emergency Parameters'!$F$54>0, 'Emergency Parameters'!$F$15/'Emergency Standards'!$E$32, \"0\")","v":1},"ambulance",41600,1,41600]
[null,null,"Access to essential drugs provided","(interagency reproductive health kit)",{"$f":"IF('Emergency Parameters'!$F$54>0, 'Emergency Parameters'!$F$15/'Emergency Standards'!$E$32, \"0\")","v":1},"kit",7350,1,7350]
[null,null,"Access to essential drugs provided","(interagency emergency and diarrea kits)",{"$f":"IF('Emergency Parameters'!$F$54>0, 'Emergency Parameters'!$F$15/'Emergency Standards'!$E$32, \"0\")","v":1},"kit",35000,1,35000]
[null,null,"Unspecified output - Health",null,1,"lumpsum",null,1,0]
[null,"Population lives in satisfactory conditions of sanitation and hygiene",null,null,null,null,null,null,{"$f":"SUM(I21:I23)","v":1200000}]
{"$rows_left_out":70}
{"sheet":"B.Staff","index":3,"n_rows":2678,"n_cols":7,"rows_kept":2678,"cut":false,"hidden":false,"merged":[[0,0,0,6]]}
["Annex II.B: Staffing Costs (included in ABOD as temporary assistance,\nbased on Emergency Parameters section III)"]
["Emergency in:",{"$f":"'Emergency Parameters'!E10","v":0}]
[]
[null,null,null,null,"Country Code:",null,{"$f":"'Emergency Parameters'!E10","v":0}]
["Function Type","Grade","Person","Amount*","Annual Salary*","Month","Amount**"]
[{"$f":"'Emergency Parameters'!D99","v":0},{"$f":"'Emergency Parameters'!E99","v":0},{"$f":"'Emergency Parameters'!F99","v":0},{"$f":"INDEX(E$37:E$3037,SUMPRODUCT(MATCH(B6&$G$4,C$37:C$3037&B$37:B$3037,0)))","v":{"$error":"#N/A"}},{"$f":"IF(ISNA(D6),0,D6)","v":0},{"$f":"'Emergency Parameters'!F$17","v":6},{"$f":"((C6*E6)/12)*F6","v":0}]
[{"$f":"'Emergency Parameters'!D100","v":0},{"$f":"'Emergency Parameters'!E100","v":0},{"$f":"'Emergency Parameters'!F100","v":0},{"$f":"INDEX(E$37:E$3037,SUMPRODUCT(MATCH(B7&$G$4,C$37:C$3037&B$37:B$3037,0)))","v":{"$error":"#N/A"}},{"$f":"IF(ISNA(D7),0,D7)","v":0},{"$f":"'Emergency Parameters'!F$17","v":6},{"$f":"((C7*E7)/12)*F7","v":0}]
[{"$f":"'Emergency Parameters'!D101","v":0},{"$f":"'Emergency Parameters'!E101","v":0},{"$f":"'Emergency Parameters'!F101","v":0},{"$error":"#N/A"},0,{"$f":"'Emergency Parameters'!F$17","v":6},0]
[{"$f":"'Emergency Parameters'!D102","v":0},{"$f":"'Emergency Parameters'!E102","v":0},{"$f":"'Emergency Parameters'!F102","v":0},{"$error":"#N/A"},0,{"$f":"'Emergency Parameters'!F$17","v":6},0]
[{"$f":"'Emergency Parameters'!D103","v":0},{"$f":"'Emergency Parameters'!E103","v":0},{"$f":"'Emergency Parameters'!F103","v":0},{"$error":"#N/A"},0,{"$f":"'Emergency Parameters'!F$17","v":6},0]
[{"$f":"'Emergency Parameters'!D104","v":0},{"$f":"'Emergency Parameters'!E104","v":0},{"$f":"'Emergency Parameters'!F104","v":0},{"$error":"#N/A"},0,{"$f":"'Emergency Parameters'!F$17","v":6},0]
[{"$f":"'Emergency Parameters'!D105","v":0},{"$f":"'Emergency Parameters'!E105","v":0},{"$f":"'Emergency Parameters'!F105","v":0},{"$error":"#N/A"},0,{"$f":"'Emergency Parameters'!F$17","v":6},0]
[{"$f":"'Emergency Parameters'!D106","v":0},{"$f":"'Emergency Parameters'!E106","v":0},{"$f":"'Emergency Parameters'!F106","v":0},{"$error":"#N/A"},0,{"$f":"'Emergency Parameters'!F$17","v":6},0]
[{"$f":"'Emergency Parameters'!D107","v":0},{"$f":"'Emergency Parameters'!E107","v":0},{"$f":"'Emergency Parameters'!F107","v":0},{"$error":"#N/A"},0,{"$f":"'Emergency Parameters'!F$17","v":6},0]
[{"$f":"'Emergency Parameters'!D108","v":0},{"$f":"'Emergency Parameters'!E108","v":0},{"$f":"'Emergency Parameters'!F108","v":0},{"$error":"#N/A"},0,{"$f":"'Emergency Parameters'!F$17","v":6},0]
[{"$f":"'Emergency Parameters'!D109","v":0},{"$f":"'Emergency Parameters'!E109","v":0},{"$f":"'Emergency Parameters'!F109","v":0},{"$error":"#N/A"},0,{"$f":"'Emergency Parameters'!F$17","v":6},0]
[{"$f":"'Emergency Parameters'!D110","v":0},{"$f":"'Emergency Parameters'!E110","v":0},{"$f":"'Emergency Parameters'!F110","v":0},{"$error":"#N/A"},0,{"$f":"'Emergency Parameters'!F$17","v":6},0]
[{"$f":"'Emergency Parameters'!D111","v":0},{"$f":"'Emergency Parameters'!E111","v":0},{"$f":"'Emergency Parameters'!F111","v":0},{"$error":"#N/A"},0,{"$f":"'Emergency Parameters'!F$17","v":6},0]
[{"$f":"'Emergency Parameters'!D112","v":0},{"$f":"'Emergency Parameters'!E112","v":0},{"$f":"'Emergency Parameters'!F112","v":0},{"$error":"#N/A"},0,{"$f":"'Emergency Parameters'!F$17","v":6},0]
[{"$f":"'Emergency Parameters'!D113","v":0},{"$f":"'Emergency Parameters'!E113","v":0},{"$f":"'Emergency Parameters'!F113","v":0},{"$error":"#N/A"},0,{"$f":"'Emergency Parameters'!F$17","v":6},0]
{"$rows_left_out":2659}
{"sheet":"C.ABOD","index":4,"n_rows":28,"n_cols":3,"rows_kept":28,"cut":false,"hidden":false,"merged":[]}
["Annex II.C: Administrative Budget - ABOD"]
[]
[]
["Emergency in:",null,{"$f":"'Emergency Parameters'!E10","v":0}]
[]
["Cost Center:"]
["Account","Chapter of Expenditure","Amount"]
[620300,"Temporary Assistance (calculated based on staffing)*",{"$f":"B.Staff!G29","v":0}]
[620500,"Overtime",0]
[622000,"Travel on Official Business",0]
[623000,"Contractual Services",0]
[624000,"General Operating Expenses",0]
[676100,"Staff/Guest Accommodations",0]
[624100,"Rental and Maintenance of Premises",0]
[624200,"Utilities",0]
[624300,"Rental of Equipment and Vehicles"]
[624400,"Communications",0]
[624500,"Hospitality",0]
[624600,"Maintenance of Furniture, Equip & Vehicles",0]
[624900,"Miscellaneous Services",0]
{"$rows_left_out":9}
{"sheet":"D.Appeal (DER)","index":5,"n_rows":32,"n_cols":6,"rows_kept":32,"cut":false,"hidden":false,"merged":[]}
["Annex II.D: Draft Appeal Budget (Based on Emergency Parameters)"]
["Emergency in:",{"$f":"'Emergency Parameters'!E10","v":0}]
[]
["Rights Group","Objectives","Operations","ABOD (Apportioned)","Staffing\n(over 6 months) (Apportioned)","Amount (USD)"]
["Basic Needs and Essential Services",null,{"$f":"SUM(C6,C7,C8,C9,C10,C11,C12,C13,C14,C15)","v":10516488.800000001},{"$f":"'2.Ops Staging for Appeal'!L5","v":0},{"$f":"'2.Ops Staging for Appeal'!N5","v":0},{"$f":"SUM(C5:D5)","v":10516488.800000001}]
[null,"Shelter and infrastructure established, improved and maintained",{"$f":"A.Ops!I6","v":3588525},{"$f":"'2.Ops Staging for Appeal'!L6","v":0},{"$f":"'2.Ops Staging for Appeal'!N6","v":0},3588525]
[null,"Population has sufficient basic and domestic items",{"$f":"A.Ops!I10","v":605272},{"$f":"'2.Ops Staging for Appeal'!L10","v":0},{"$f":"'2.Ops Staging for Appeal'!N10","v":0},605272]
[null,"Health status of the population improved",{"$f":"A.Ops!I13","v":686095},{"$f":"'2.Ops Staging for Appeal'!L13","v":0},{"$f":"'2.Ops Staging for Appeal'!N13","v":0},686095]
[null,"Population lives in satisfactory conditions of sanitation and hygiene",{"$f":"A.Ops!I20","v":1200000},{"$f":"'2.Ops Staging for Appeal'!L20","v":0},{"$f":"'2.Ops Staging for Appeal'!N20","v":0},1200000]
[null,"Population has optimal access to education",{"$f":"A.Ops!I24","v":624276.80000000005},{"$f":"'2.Ops Staging for Appeal'!L24","v":0},{"$f":"'2.Ops Staging for Appeal'!N24","v":0},624276.80000000005]
[null,"Supply of potable water increased or maintained",{"$f":"A.Ops!I29","v":2428000},{"$f":"'2.Ops Staging for Appeal'!L29","v":0},{"$f":"'2.Ops Staging for Appeal'!N29","v":0},2428000]
[null,"Services for persons with specific needs strengthened",{"$f":"A.Ops!I33","v":200000},{"$f":"'2.Ops Staging for Appeal'!L33","v":0},{"$f":"'2.Ops Staging for Appeal'!N33","v":0},200000]
[null,"Food security improved",{"$f":"A.Ops!I36","v":750000},{"$f":"'2.Ops Staging for Appeal'!L36","v":0},{"$f":"'2.Ops Staging for Appeal'!N36","v":0},750000]
[null,"Population has sufficient access to energy",{"$f":"A.Ops!I39","v":300000},{"$f":"'2.Ops Staging for Appeal'!L39","v":0},{"$f":"'2.Ops Staging for Appeal'!N39","v":0},300000]
[null,"Nutritional well-being improved",{"$f":"A.Ops!I42","v":134320},{"$f":"'2.Ops Staging for Appeal'!L42","v":0},{"$f":"'2.Ops Staging for Appeal'!N42","v":0},134320]
["Logistics and Operations Support",null,{"$f":"SUM(C17,C18)","v":1269892.8296000001},{"$f":"'2.Ops Staging for Appeal'!L47","v":0},{"$f":"'2.Ops Staging for Appeal'!N47","v":0},1269892.8296000001]
[null,"Logistics and supply optimized to serve operational needs",{"$f":"A.Ops!I48","v":293123.82},{"$f":"'2.Ops Staging for Appeal'!L48","v":0},{"$f":"'2.Ops Staging for Appeal'!N48","v":0},293123.82]
[null,"Operations management, coordination and support strengthened and optimized",{"$f":"A.Ops!I51","v":976769.00960000011},{"$f":"'2.Ops Staging for Appeal'!L51","v":0},{"$f":"'2.Ops Staging for Appeal'!N51","v":0},976769.00960000011]
["Security from Violence and Exploitation",null,{"$f":"SUM(C20,C21,C22)","v":730000},{"$f":"'2.Ops Staging for Appeal'!L54","v":0},{"$f":"'2.Ops Staging for Appeal'!N54","v":0},730000]
[null,"Risk of SGBV is reduced and quality of response improved",{"$f":"A.Ops!I55","v":10000},{"$f":"'2.Ops Staging for Appeal'!L55","v":0},{"$f":"'2.Ops Staging for Appeal'!N55","v":0},10000]
{"$rows_left_out":13}
{"sheet":"E. Positions (optional)","index":6,"n_rows":32,"n_cols":10,"rows_kept":32,"cut":false,"hidden":false,"merged":[[3,0,5,0],[3,1,5,1],[3,7,5,7],[1,1,1,2],[23,1,23,2],[3,8,3,9],[4,8,4,9],[3,2,5,2],[3,3,5,3],[3,4,5,4],[3,5,5,5],[3,6,5,6],[31,2,31,3],[26,2,26,3],[27,2,27,3],[28,2,28,3],[29,2,29,3],[30,2,30,3],[26,6,26,9],[27,6,27,9],[28,6,28,9],[29,6,29,9],[30,6,30,9],[31,6,31,9]]}
["Annex II.E: Position Requirements beyond 6 months - Budget Changes"]
["Emergency in:",{"$f":"'Emergency Parameters'!E10","v":0}]
[]
["MSRP Cost Centre","MSRP\nPosition No.","Chartfield Codes\n(to be completed by ARBAS)","Post Title","Supervisor\nPosition No.","Grade","Reason Code\n (see table below)","Effective\nDates/Comments","Estimated costs (US dollars)"]
[null,null,null,null,null,null,null,null,2015]
[null,null,null,null,null,null,null,null,"increase","(decrease)"]
["CC….","NEW","N/A","Field Coordinator",10003458,"P4","NEW","01/05/2020 - 31/12/2020","(annual cost/12*8)"]
[]
[]
[]
[]
[]
[]
[]
[]
[]
[]
[]
[]
[null,null,null,null,null,null,null,"Total:",{"$f":"SUM(I7:I19)","v":0},{"$f":"SUM(J7:J19)","v":0}]
{"$rows_left_out":13}
{"sheet":"Summary","index":7,"n_rows":8,"n_cols":2,"rows_kept":8,"cut":false,"hidden":false,"merged":[[0,0,0,1]]}
["Resource Requirements Summary"]
["Emergency in:",{"$f":"'Emergency Parameters'!E10","v":0}]
[]
["Budget Component","Amount (USD)"]
["Operations",{"$f":"A.Ops!I87","v":13186381.629600001}]
["ABOD",{"$f":"'C.ABOD'!C27","v":0}]
["Staffing (beyond 6 months)",{"$f":"'E. Positions (optional)'!J21","v":0}]
["TOTAL",{"$f":"SUM(B5:B7)","v":13186381.629600001}]

{"sheet":"Emergency Standards","index":8,"n_rows":38,"n_cols":6,"rows_kept":38,"cut":false,"hidden":false,"merged":[[28,2,28,3],[28,4,28,5],[28,0,28,1],[1,0,1,1],[1,2,1,3],[1,4,1,5],[13,2,13,5]]}
["Modular (Site) Planning"]
["Module",null,"Consisting of",null,"Approximately"]
[1,"family**",1,"family",4,"persons"]
[1,"community",16,"families",80,"persons"]
[1,"block",16,"communities",1250,"persons"]
[1,"sector",4,"blocks",5000,"persons"]
[1,"camp module***",2,"sectors",10000,"persons"]
["* Emergency Handbook, 3rd edition, page 216."]
["** Average family size has been modified from 5 to 3."]
["** Camp module consists of 4 sectors of 20,000 -> reduced to 2 sectors of 10,000 (by DESS template)"]
[]
[]
["Site Planning Figures"]
[null,"Resource","Need"]
[null,"Land",45,"m2 per pax"]
[null,"Shelter space",3.5,"m2 per pax"]
[null,"Roads and walkways",25,"% ","of entire site"]
[null,"Open space and public facilities",20,"%","of entire site"]
[null,"Environmental sanitation",1,"latrine",20,"person"]
[null,"Water",20,"litre",1,"person/day"]
{"$rows_left_out":19}
{"sheet":"Unit Costs","index":9,"n_rows":87,"n_cols":9,"rows_kept":87,"cut":false,"hidden":false,"merged":[[86,0,86,5],[2,0,2,5],[27,0,27,3],[9,0,9,4],[24,0,24,4]]}
["Tables and information on this sheet are extracted and adapted from the Modular Budget templated prepared by DESS."]
[]
["Unit Costings"]
["Shelter"]
["Details","Amounts per person","Unit Cost","Qty","Time","Package Cost"]
["Family Tent","1/family",419.83,1,null,{"$f":"C6*D6","v":419.83}]
["Tent ridge double fold (4x4m)","1/family",257.39999999999998,1,null,{"$f":"C7*D7","v":257.39999999999998}]
["Plastic sheeting","1/family",16.38,1,null,{"$f":"C8*D8","v":16.38}]
["Plastic rolls (1/200 persons)","1/family",4.0949999999999998,1,null,{"$f":"C9*D9","v":4.0949999999999998}]
["Emergency shelter provided (tent/materials/kit)",null,null,null,null,{"$f":"SUM(F6:F9)","v":697.70500000000004}]
[]
[]
["NFI"]
["Details","Amounts per person","Unit Cost","Qty","Time","Package Cost"]
["Blankets ","1/person",5.952,{"$f":"'Emergency Standards'!E3","v":4},null,{"$f":"C15*D15","v":23.808}]
["Cooking stove","1/family",10,1,null,10]
["Heating stove","1/family",20,1,null,20]
["Plastic bucket (10L)","2/family",2.52,2,null,5.04]
["Jerry cans - Water (10L)","2/family",1.86,2,null,3.72]
["Kitchen sets","1/family",16.2,1,null,16.2]
{"$rows_left_out":68}
{"sheet":"2.Ops Staging for Appeal","index":10,"n_rows":88,"n_cols":14,"rows_kept":88,"cut":false,"hidden":true,"merged":[[0,0,0,8]]}
["Annex 2.A: Operations Budget"]
["Emergency in:",null,{"$f":"'Emergency Parameters'!E10","v":0}]
[]
["Rights Group","Objectives","Outputs / Budget Lines",null,"Qty (Target)","Unit","Unit Cost","Time","Amount (USD)","Output Total",null,"ABOD Apportioned",null,"Staff Costs (non-TA)\nApportioned"]
["Basic Needs and Essential Services",null,null,null,null,null,null,null,{"$f":"A.Ops!I5","v":10516488.800000001},null,null,{"$f":"SUM(L6,L10,L13,L20,L24,L29,L33,L36,L39,L42)","v":0},null,{"$f":"SUM(N6,N10,N13,N20,N24,N29,N33,N36,N39,N42)","v":0}]
[null,"Shelter and infrastructure established, improved and maintained",null,null,{"$f":"A.Ops!E6","v":0},null,{"$f":"A.Ops!G6","v":0},{"$f":"A.Ops!H6","v":0},{"$f":"A.Ops!I6","v":3588525},null,null,{"$f":"SUM(L7:L9)","v":0},null,{"$f":"SUM(N7:N9)","v":0}]
[null,null,"Emergency shelter provided","tent/materials/kit",{"$f":"A.Ops!E7","v":5000},"shelter",{"$f":"A.Ops!G7","v":697.70500000000004},{"$f":"A.Ops!H7","v":1},{"$f":"A.Ops!I7","v":3488525}]
[null,null,"Emergency shelter provided","site preparation",{"$f":"A.Ops!E8","v":2},"camp",{"$f":"A.Ops!G8","v":50000},{"$f":"A.Ops!H8","v":1},{"$f":"A.Ops!I8","v":100000},{"$f":"SUM(I7:I8)","v":3588525},{"$f":"IF(J8>0, 1, \"\")","v":1},{"$f":"IF(K8=1, ($L$87/$K$87), 0)","v":0},{"$f":"IF(L8>0, 1, \"\")","v":""},{"$f":"IF(K8=1, ($N$87/$M$87), 0)","v":0}]
[null,null,"Unspecified output - Shelter and Infrastructure","other - define",{"$f":"A.Ops!E9","v":1},"lumpsum",{"$f":"A.Ops!G9","v":0},{"$f":"A.Ops!H9","v":1},{"$f":"A.Ops!I9","v":0},{"$f":"SUM(I9)","v":0},{"$f":"IF(J9>0, 1, \"\")","v":""},{"$f":"IF(K9=1, ($L$87/$K$87), 0)","v":0},{"$f":"IF(L9>0, 1, \"\")","v":""},{"$f":"IF(K9=1, ($N$87/$M$87), 0)","v":0}]
[null,"Population has sufficient basic and domestic items",null,null,{"$f":"A.Ops!E10","v":0},null,{"$f":"A.Ops!G10","v":0},{"$f":"A.Ops!H10","v":0},{"$f":"A.Ops!I10","v":605272},null,"",{"$f":"SUM(L11:L12)","v":0},"",{"$f":"SUM(N11:N12)","v":0}]
[null,null,"Household goods provided",null,{"$f":"A.Ops!E11","v":5000},"family",{"$f":"A.Ops!G11","v":121.0544},{"$f":"A.Ops!H11","v":1},{"$f":"A.Ops!I11","v":605272},{"$f":"I11","v":605272},1,{"$f":"IF(K11=1, ($L$87/$K$87), 0)","v":0},"",{"$f":"IF(K11=1, ($N$87/$M$87), 0)","v":0}]
[null,null,"Unspecified output - Basic and Domestic Items",null,{"$f":"A.Ops!E12","v":1},"lumpsum",{"$f":"A.Ops!G12","v":0},{"$f":"A.Ops!H12","v":1},{"$f":"A.Ops!I12","v":0},{"$f":"I12","v":0},"",0,"",{"$f":"IF(K12=1, ($N$87/$M$87), 0)","v":0}]
[null,"Health status of the population improved",null,null,{"$f":"A.Ops!E13","v":0},null,{"$f":"A.Ops!G13","v":0},{"$f":"A.Ops!H13","v":0},{"$f":"A.Ops!I13","v":686095},null,"",{"$f":"SUM(L14:L19)","v":0},"",{"$f":"SUM(N14:N19)","v":0}]
[null,null,"Access to primary health care services provided or supported",null,{"$f":"A.Ops!E14","v":20000},"person",{"$f":"A.Ops!G14","v":5},{"$f":"A.Ops!H14","v":6},{"$f":"A.Ops!I14","v":600000},{"$f":"SUM(I14:I16)","v":643745},1,0,"",{"$f":"IF(K14=1, ($N$87/$M$87), 0)","v":0}]
[null,null,"Access to primary health care services provided or supported","(hospital tent)",{"$f":"A.Ops!E15","v":1},"centre",{"$f":"A.Ops!G15","v":2145},{"$f":"A.Ops!H15","v":1},{"$f":"A.Ops!I15","v":2145},null,"",0,"",0]
[null,null,"Access to primary health care services provided or supported","(ambulance)",{"$f":"A.Ops!E16","v":1},"ambulance",{"$f":"A.Ops!G16","v":41600},{"$f":"A.Ops!H16","v":1},{"$f":"A.Ops!I16","v":41600},null,"",0,"",0]
[null,null,"Access to essential drugs provided","(interagency reproductive health kit)",{"$f":"A.Ops!E17","v":1},"kit",{"$f":"A.Ops!G17","v":7350},{"$f":"A.Ops!H17","v":1},{"$f":"A.Ops!I17","v":7350},{"$f":"SUM(I17:I18)","v":42350},1,0,"",0]
[null,null,"Access to essential drugs provided","(interagency emergency and diarrea kits)",{"$f":"A.Ops!E18","v":1},"kit",{"$f":"A.Ops!G18","v":35000},{"$f":"A.Ops!H18","v":1},{"$f":"A.Ops!I18","v":35000},null,"",0,"",0]
[null,null,"Unspecified output - Health",null,{"$f":"A.Ops!E19","v":1},"lumpsum",{"$f":"A.Ops!G19","v":0},{"$f":"A.Ops!H19","v":1},{"$f":"A.Ops!I19","v":0},{"$f":"I19","v":0},"",0,"",0]
[null,"Population lives in satisfactory conditions of sanitation and hygiene",null,null,{"$f":"A.Ops!E20","v":0},null,{"$f":"A.Ops!G20","v":0},{"$f":"A.Ops!H20","v":0},{"$f":"A.Ops!I20","v":1200000},null,"",{"$f":"SUM(L21:L23)","v":0},"",{"$f":"SUM(N21:N23)","v":0}]
{"$rows_left_out":68}